est remplacé par
type: Label
created: 2013-11-19T00:00:00+01:00

009-Type de relation entre ressources
type: ConceptScheme
has top concept: est remplacé par

Vocabulaires ScoLOMFR
type: ConceptScheme
preferred label: ScoLOMFR Vocabulary @en
has top concept: est remplacé par

est remplacé par
type: Concept
in scheme: 009-Type de relation entre ressources
in scheme: Vocabulaires ScoLOMFR
top concept of: 009-Type de relation entre ressources
top concept of: Vocabulaires ScoLOMFR
status: Actuel
definition: Type (relation)
pref label: est remplacé par
scope note: La ressource décrite est supplantée, déplacée ou remplacée par la ressource référencée. S'utilise lorsque l'on souhaite préserver des versions successives (au sens de mise à jour) d'une même ressource.