ScoLomFr Vocabulaire09
type: ConceptScheme
has top concept: est remplacé par

est remplacé par
type: Concept
top concept of: ScoLomFr Vocabulaire09
top concept of: Vocabulaires ScoLomFr du CNDP
scope note: La ressource décrite est supplantée, déplacée ou remplacée par la ressource référencée. S’utilise lorsque l'on souhaite préserver des versions successives (au sens de mise à jour) d'une même ressource.
in scheme: ScoLomFr Vocabulaire09
in scheme: Vocabulaires ScoLomFr du CNDP

Vocabulaires ScoLomFr du CNDP
type: ConceptScheme
preferred label: CNDP ScoLomFr vocabulary @en
has top concept: est remplacé par