Vocabulaires ScoLomFr du CNDP
type: ConceptScheme
has top concept: est référencé par
preferred label: CNDP ScoLomFr vocabulary @en

ScoLomFr Vocabulaire09
type: ConceptScheme
has top concept: est référencé par

est référencé par
type: Concept
in scheme: ScoLomFr Vocabulaire09
in scheme: Vocabulaires ScoLomFr du CNDP
scope note: La ressource décrite est référencée, citée ou sinon désignée par la ressource référencée. Cette relation peut servir à lier une critique de la ressource à la ressource, une satire d'un discours à l'original, etc. Une vignette ou une référence bibliographique rentrent dans cette catégorie.
top concept of: ScoLomFr Vocabulaire09
top concept of: Vocabulaires ScoLomFr du CNDP